Target
Cyclin-dependent kinase 8
Ligand
BDBM50241889
Substrate
Meas. Tech.
ChEMBL_1670928 (CHEMBL4020957)
EC50
110±n/a nM
Citation
 Fujimoto, JHirayama, THirata, YHikichi, YMurai, SHasegawa, MHasegawa, YYonemori, KHata, AAoyama, KCary, DR Studies of CDK 8/19 inhibitors: Discovery of novel and selective CDK8/19 dual inhibitors and elimination of their CYP3A4 time-dependent inhibition potential. Bioorg Med Chem 25:3018-3033 (2017)  
Target
Name:
Cyclin-dependent kinase 8
Synonyms:
CDK8 Cell division protein kinase 8 Mediator complex subunit CDK8 Protein kinase K35
Type:
Serine/threonine-protein kinase
Mol. Mass.:
53300.21
Organism:
Homo sapiens (Human)
Description:
P49336
Residue:
464
  
Inhibitor
Name:
BDBM50241889
Synonyms:
CHEMBL4083599
Type:
Small organic molecule
Emp. Form.:
C18H16N4O
Mol. Mass.:
304.3458
SMILES:
Cn1cc(cn1)-c1ccncc1\C=C\C(=O)Nc1ccccc1
: