Target
Tyrosine-protein kinase JAK2
Ligand
BDBM50021656
Substrate
Meas. Tech.
ChEMBL_1672941 (CHEMBL4022970)
IC50
7.0±n/a nM
Citation
 Vazquez, MLKaila, NStrohbach, JWTrzupek, JDBrown, MFFlanagan, MEMitton-Fry, MJJohnson, TATenBrink, REArnold, EPBasak, AHeasley, SEKwon, SLangille, JParikh, MDGriffin, SHCasavant, JMDuclos, BAFenwick, AEHarris, TMHan, SCaspers, NDowty, MEYang, XBanker, MEHegen, MSymanowicz, PTLi, LWang, LLin, THJussif, JClark, JDTelliez, JBRobinson, RPUnwalla, R Identification of N-{cis-3-[Methyl(7H-pyrrolo[2,3-d]pyrimidin-4-yl)amino]cyclobutyl}propane-1-sulfonamide (PF-04965842): A Selective JAK1 Clinical Candidate for the Treatment of Autoimmune Diseases. J Med Chem 61:1130-1152 (2018)  
Target
Name:
Tyrosine-protein kinase JAK2
Synonyms:
JAK-2 JAK2_HUMAN Janus kinase 2 (JAK2) | Janus kinase 2 (a protein tyrosine kinase)
Type:
Protein
Mol. Mass.:
130684.68
Organism:
Homo sapiens (Human)
Description:
O60674
Residue:
1132
  
Inhibitor
Name:
BDBM50021656
Synonyms:
BARICITINIB LY-3009104 US10766894, Compound TABLE 1.19 US11203595, TABLE 1.19 US20230416237, Example baricitinib
Type:
Small organic molecule
Emp. Form.:
C16H17N7O2S
Mol. Mass.:
371.417
SMILES:
CCS(=O)(=O)N1CC(CC#N)(C1)n1cc(cn1)-c1ncnc2[nH]ccc12
: