Target
Cyclin-dependent kinase 8
Ligand
BDBM50248635
Substrate
Meas. Tech.
ChEMBL_1679212 (CHEMBL4029489)
EC50
2.0±n/a nM
Citation
 Ono, KBanno, HOkaniwa, MHirayama, TIwamura, NHikichi, YMurai, SHasegawa, MHasegawa, YYonemori, KHata, AAoyama, KCary, DR Design and synthesis of selective CDK8/19 dual inhibitors: Discovery of 4,5-dihydrothieno[3',4':3,4]benzo[1,2-d]isothiazole derivatives. Bioorg Med Chem 25:2336-2350 (2017)  
Target
Name:
Cyclin-dependent kinase 8
Synonyms:
CDK8 Cell division protein kinase 8 Mediator complex subunit CDK8 Protein kinase K35
Type:
Serine/threonine-protein kinase
Mol. Mass.:
53300.21
Organism:
Homo sapiens (Human)
Description:
P49336
Residue:
464
  
Inhibitor
Name:
BDBM50248635
Synonyms:
CHEMBL4070408
Type:
Small organic molecule
Emp. Form.:
C16H13N3O2S2
Mol. Mass.:
343.423
SMILES:
Cc1ncccc1Oc1sc(C(N)=O)c2CCc3cnsc3-c12
: