Target
Cyclin-dependent kinase 8
Ligand
BDBM50248634
Substrate
Meas. Tech.
ChEMBL_1679212 (CHEMBL4029489)
EC50
66±n/a nM
Citation
 Ono, KBanno, HOkaniwa, MHirayama, TIwamura, NHikichi, YMurai, SHasegawa, MHasegawa, YYonemori, KHata, AAoyama, KCary, DR Design and synthesis of selective CDK8/19 dual inhibitors: Discovery of 4,5-dihydrothieno[3',4':3,4]benzo[1,2-d]isothiazole derivatives. Bioorg Med Chem 25:2336-2350 (2017)  
Target
Name:
Cyclin-dependent kinase 8
Synonyms:
CDK8 Cell division protein kinase 8 Mediator complex subunit CDK8 Protein kinase K35
Type:
Serine/threonine-protein kinase
Mol. Mass.:
53300.21
Organism:
Homo sapiens (Human)
Description:
P49336
Residue:
464
  
Inhibitor
Name:
BDBM50248634
Synonyms:
CHEMBL4061783
Type:
Small organic molecule
Emp. Form.:
C15H11N3O2S2
Mol. Mass.:
329.397
SMILES:
NC(=O)c1sc(Oc2ccccn2)c-2c1CCc1cnsc-21
: