Target
Advanced glycosylation end product-specific receptor
Ligand
BDBM50249573
Substrate
Meas. Tech.
ChEBML_1680057
Kd
2.0±n/a nM
Citation
 Bongarzone, SSavickas, VLuzi, FGee, AD Targeting the Receptor for Advanced Glycation Endproducts (RAGE): A Medicinal Chemistry Perspective. J Med Chem 60:7213-7232 (2017)  
Target
Name:
Advanced glycosylation end product-specific receptor
Synonyms:
AGER RAGE_HUMAN | Receptor for advanced glycosylation end products
Type:
PROTEIN
Mol. Mass.:
42800.11
Organism:
Homo sapiens (Human)
Description:
ChEMBL_1339877
Residue:
404
  
Inhibitor
Name:
BDBM50249573
Synonyms:
CHEMBL4063929
Type:
Small organic molecule
Emp. Form.:
C18H17NO7
Mol. Mass.:
359.3301
SMILES:
COC(=O)c1cc(O)c(O)cc1NC(=O)C1Oc2ccccc2OC1C
: