Target
Advanced glycosylation end product-specific receptor
Ligand
BDBM50249582
Substrate
Meas. Tech.
ChEBML_1680057
Kd
32±n/a nM
Citation
 Bongarzone, SSavickas, VLuzi, FGee, AD Targeting the Receptor for Advanced Glycation Endproducts (RAGE): A Medicinal Chemistry Perspective. J Med Chem 60:7213-7232 (2017)  
Target
Name:
Advanced glycosylation end product-specific receptor
Synonyms:
AGER RAGE_HUMAN | Receptor for advanced glycosylation end products
Type:
PROTEIN
Mol. Mass.:
42800.11
Organism:
Homo sapiens (Human)
Description:
ChEMBL_1339877
Residue:
404
  
Inhibitor
Name:
BDBM50249582
Synonyms:
CHEMBL1547178 | US10729695, Compound CB-13
Type:
Small organic molecule
Emp. Form.:
C16H14ClFN2O2
Mol. Mass.:
320.746
SMILES:
Cc1c(Cl)cccc1NC(=O)CNC(=O)c1ccccc1F
: