Target
Tyrosine-protein phosphatase non-receptor type 1
Ligand
BDBM50250606
Substrate
Meas. Tech.
ChEBML_1681983
Ki
5900±n/a nM
Citation
 Witten, MRWissler, LSnow, MGeschwindner, SRead, JABrandon, NJNairn, ACLombroso, PJKäck, HEllman, JA X-ray Characterization and Structure-Based Optimization of Striatal-Enriched Protein Tyrosine Phosphatase Inhibitors. J Med Chem 60:9299-9319 (2017)  
Target
Name:
Tyrosine-protein phosphatase non-receptor type 1
Synonyms:
PTN1_HUMAN PTPN1 Protein tyrosine phosphatase-1B (PTP1B) Protein-tyrosine phosphatase 1B (PTP1B) Tyrosine-protein phosphatase non-receptor type 1 (PTP1B)
Type:
Protein phosphatase
Mol. Mass.:
49963.76
Organism:
Homo sapiens (Human)
Description:
Human recombinant GST-fusion PTP1B (1-435).
Residue:
435
  
Inhibitor
Name:
BDBM50250606
Synonyms:
CHEMBL4077342
Type:
Small organic molecule
Emp. Form.:
C24H21Cl3F2NO6PS
Mol. Mass.:
626.821
SMILES:
OP(O)(=O)C(F)(c1ccc(cc1)-c1cccc(Cc2cc(Cl)c(Cl)cc2Cl)c1F)S(=O)(=O)N1CCOCC1
: