Target
Ectonucleotide pyrophosphatase/phosphodiesterase family member 2
Ligand
BDBM50257807
Substrate
Meas. Tech.
ChEBML_1690005
IC50
5.0±n/a nM
Citation
 Joncour, ADesroy, NHousseman, CBock, XBienvenu, NCherel, LLabeguere, VPeixoto, CAnnoot, DLepissier, LHeiermann, JHengeveld, WJPilzak, GMonjardet, AWakselman, ERoncoroni, VLe Tallec, SGalien, RDavid, CVandervoort, NChristophe, TConrath, KJans, MWohlkonig, ASoror, SSteyaert, JTouitou, RFleury, DVercheval, LMollat, PTriballeau, Nvan der Aar, EBrys, RHeckmann, B Discovery, Structure-Activity Relationship, and Binding Mode of an Imidazo[1,2-a]pyridine Series of Autotaxin Inhibitors. J Med Chem 60:7371-7392 (2017)  
Target
Name:
Ectonucleotide pyrophosphatase/phosphodiesterase family member 2
Synonyms:
ATX Autotaxin (ATX) ENPP2 Ectonucleotide Pyrophosphatase/Phosphodiesterase 2 (ENPP2) Extracellular lysophospholipase D PDNP2
Type:
Enzyme
Mol. Mass.:
99007.13
Organism:
Homo sapiens (Human)
Description:
Q13822
Residue:
863
  
Inhibitor
Name:
BDBM50257807
Synonyms:
CHEMBL4073638
Type:
Small organic molecule
Emp. Form.:
C28H31ClN6O3S
Mol. Mass.:
567.102
SMILES:
CCOC(=O)N1CCC(CC1)NC(=O)c1ccc2nc(CC)c(N(C)c3nc(cs3)-c3ccc(Cl)cc3)n2c1
: