Target
D(1A) dopamine receptor
Ligand
BDBM50010591
Substrate
Meas. Tech.
ChEBML_58174
IC50
895.0±n/a nM
Citation
 Davis, DAde Paulis, TJanowsky, ASmith, HE Chloro-substituted, sterically hindered 5,11-dicarbo analogues of clozapine as potential chiral antipsychotic agents. J Med Chem 33:809-14 (1990)  
Target
Name:
D(1A) dopamine receptor
Synonyms:
DOPAMINE D1 Dopamine D1 high Dopamine receptor Dopamine1-like Drd1a
Type:
Enzyme Catalytic Domain
Mol. Mass.:
49429.75
Organism:
RAT
Description:
P18901
Residue:
446
  
Inhibitor
Name:
BDBM50010591
Synonyms:
11-(4-Methyl-piperazin-1-yl)-5H-dibenzo[b,e][1,4]diazepine | CHEMBL73538
Type:
Small organic molecule
Emp. Form.:
C18H20N4
Mol. Mass.:
292.3782
SMILES:
CN1CCN(CC1)C1=Nc2ccccc2Nc2ccccc12
: