Target
D(1A) dopamine receptor
Ligand
BDBM50010593
Substrate
Meas. Tech.
ChEBML_58174
IC50
443.0±n/a nM
Citation
 Davis, DAde Paulis, TJanowsky, ASmith, HE Chloro-substituted, sterically hindered 5,11-dicarbo analogues of clozapine as potential chiral antipsychotic agents. J Med Chem 33:809-14 (1990)  
Target
Name:
D(1A) dopamine receptor
Synonyms:
DOPAMINE D1 Dopamine D1 high Dopamine receptor Dopamine1-like Drd1a
Type:
Enzyme Catalytic Domain
Mol. Mass.:
49429.75
Organism:
RAT
Description:
P18901
Residue:
446
  
Inhibitor
Name:
BDBM50010593
Synonyms:
1-(2-Chloro-5-isopropylidene-5H-dibenzo[a,d]cyclohepten-10-yl)-4-methyl-piperazine | CHEMBL328246
Type:
Small organic molecule
Emp. Form.:
C23H25ClN2
Mol. Mass.:
364.911
SMILES:
[#6]-[#7]-1-[#6]-[#6]-[#7](-[#6]-[#6]-1)-[#6]-1=[#6]-c2cc(Cl)ccc2\[#6](=[#6](/[#6])-[#6])-c2ccccc-12
: