Target
Arachidonate 5-lipoxygenase-activating protein
Ligand
BDBM50262010
Substrate
Meas. Tech.
ChEMBL_1696511 (CHEMBL4047401)
IC50
37±n/a nM
Citation
 Bartolozzi, AAbeywardane, ABosanac, TBroadwater, JAChen, ZHutzler, JMHuber, JDNemoto, POlague, ARiether, DSimpson, TTakahashi, HWu, LZhang, YZindell, RM Discovery and optimization of oxadiazole-based FLAP inhibitors. Bioorg Med Chem Lett 27:4652-4659 (2017)  
Target
Name:
Arachidonate 5-lipoxygenase-activating protein
Synonyms:
5-lipoxygenase activating protein 5-lipoxygenase/FLAP ALOX5AP MK-886-binding protein
Type:
Enzyme
Mol. Mass.:
18159.90
Organism:
Homo sapiens (Human)
Description:
P20292
Residue:
161
  
Inhibitor
Name:
BDBM50262010
Synonyms:
CHEMBL4080876
Type:
Small organic molecule
Emp. Form.:
C22H20N8O
Mol. Mass.:
412.4472
SMILES:
Nc1ncc(cn1)-c1ccc(cc1)C1(CCC1)c1noc(n1)-c1cnn(CCC#N)c1
: