Target
Indoleamine 2,3-dioxygenase 1
Ligand
BDBM309529
Substrate
Meas. Tech.
ChEMBL_1707516 (CHEMBL4058749)
Kd
22300±n/a nM
Citation
 Crosignani, SBingham, PBottemanne, PCannelle, HCauwenberghs, SCordonnier, MDalvie, DDeroose, FFeng, JLGomes, BGreasley, SKaiser, SEKraus, MNégrerie, MMaegley, KMiller, NMurray, BWSchneider, MSoloweij, JStewart, AETumang, JTorti, VRVan Den Eynde, BWythes, M Discovery of a Novel and Selective Indoleamine 2,3-Dioxygenase (IDO-1) Inhibitor 3-(5-Fluoro-1H-indol-3-yl)pyrrolidine-2,5-dione (EOS200271/PF-06840003) and Its Characterization as a Potential Clinical Candidate. J Med Chem 60:9617-9629 (2017)  
Target
Name:
Indoleamine 2,3-dioxygenase 1
Synonyms:
I23O1_HUMAN IDO-1 INDO Indoleamine 2,3-dioxygenase | Indoleamine-pyrrole 2,3-dioxygenase
Type:
Enzyme
Mol. Mass.:
45330.80
Organism:
Homo sapiens (Human)
Description:
P14902
Residue:
403
  
Inhibitor
Name:
BDBM309529
Synonyms:
3-(5-fluoro-1H-indol-3- yl)pyrrolidine-2,5-dione US9603836, Compound 1 US9949951, 1a
Type:
Small organic molecule
Emp. Form.:
C12H9FN2O2
Mol. Mass.:
232.2105
SMILES:
Fc1ccc2[nH]cc(C3CC(=O)NC3=O)c2c1
: