Target
Sialidase-4
Ligand
BDBM50270464
Substrate
Meas. Tech.
ChEMBL_1708161 (CHEMBL4059394)
Ki
260±n/a nM
Citation
 Guo, TDätwyler, PDemina, ERichards, MRGe, PZou, CZheng, RFougerat, APshezhetsky, AVErnst, BCairo, CW Selective Inhibitors of Human Neuraminidase 3. J Med Chem 61:1990-2008 (2018)  
Target
Name:
Sialidase-4
Synonyms:
NEU4 Sialidase 4
Type:
PROTEIN
Mol. Mass.:
51579.82
Organism:
Homo sapiens (Human)
Description:
ChEMBL_960637
Residue:
484
  
Inhibitor
Name:
BDBM50270464
Synonyms:
CHEMBL4076203
Type:
Small organic molecule
Emp. Form.:
C25H26N4O7
Mol. Mass.:
494.4965
SMILES:
[H][C@]1(OC(=C[C@H](O)[C@H]1NC(C)=O)C(O)=O)[C@H](O)[C@H](O)Cn1cc(nn1)-c1ccc(cc1)-c1ccccc1
: