Target
C-C chemokine receptor type 4
Ligand
BDBM50278787
Substrate
Meas. Tech.
ChEMBL_1719307 (CHEMBL4134307)
IC50
7.9±n/a nM
Citation
 Kindon, NAndrews, GBaxter, ACheshire, DHemsley, PJohnson, TLiu, YZMcGinnity, DMcHale, MMete, AReuberson, JRoberts, BSteele, JTeobald, BUnitt, JVaughan, DWalters, IStocks, MJ Discovery of AZD-2098 and AZD-1678, Two Potent and Bioavailable CCR4 Receptor Antagonists. ACS Med Chem Lett 8:981-986 (2017)  
Target
Name:
C-C chemokine receptor type 4
Synonyms:
C-C CKR-4 C-C chemokine receptor type 4 (CCR4) CCR-4 CCR4_HUMAN CMKBR4 | K5-5
Type:
Enzyme
Mol. Mass.:
41406.41
Organism:
Homo sapiens (Human)
Description:
P51679
Residue:
360
  
Inhibitor
Name:
BDBM50278787
Synonyms:
CHEMBL4173861
Type:
Small organic molecule
Emp. Form.:
C9H6Cl3N3O3S2
Mol. Mass.:
374.651
SMILES:
COc1nc(Cl)cnc1NS(=O)(=O)c1scc(Cl)c1Cl
: