Target
Vasopressin V1a receptor
Ligand
BDBM50032907
Substrate
Meas. Tech.
ChEMBL_1724088 (CHEMBL4139366)
EC50
0.158489±n/a nM
Citation
 Katte, TAReekie, TAWerry, ELJorgensen, WTBoyd, RWong, ECNGulliver, DWConnor, MKassiou, M Investigation of pyrazolo-sulfonamides as putative small molecule oxytocin receptor agonists. Eur J Med Chem 136:330-333 (2017)  
Target
Name:
Vasopressin V1a receptor
Synonyms:
AVPR V1a AVPR1A V1AR_HUMAN VASOPRESSIN V1A Vasopressin V1 receptor Vasopressin receptor
Type:
Receptor
Mol. Mass.:
46820.18
Organism:
Homo sapiens (Human)
Description:
P37288
Residue:
418
  
Inhibitor
Name:
BDBM50032907
Synonyms:
CHEMBL3342790
Type:
Small organic molecule
Emp. Form.:
C15H11F3N4O2S
Mol. Mass.:
368.334
SMILES:
FC(F)(F)c1ccc(cc1)S(=O)(=O)Nc1ccnn1-c1ccccn1
: