Target
Glycogen synthase kinase-3 beta
Ligand
BDBM50291346
Substrate
Meas. Tech.
ChEMBL_1731029 (CHEMBL4146565)
IC50
1.3±n/a nM
Citation
 Saraswati, APAli Hussaini, SMKrishna, NHBabu, BNKamal, A Glycogen synthase kinase-3 and its inhibitors: Potential target for various therapeutic conditions. Eur J Med Chem 144:843-858 (2018)  
Target
Name:
Glycogen synthase kinase-3 beta
Synonyms:
GSK-3 beta GSK3B Glycogen synthase kinase 3 beta (GSK3B) Glycogen synthase kinase-3 beta (GSK-3B) Glycogen synthase kinase-3 beta (GSK3B) Glycogen synthase kinase-3beta (GSK3B) | Serine/threonine-protein kinase GSK3B
Type:
Enzyme
Mol. Mass.:
46756.38
Organism:
Homo sapiens (Human)
Description:
P49841
Residue:
420
  
Inhibitor
Name:
BDBM50291346
Synonyms:
CHEMBL4162850
Type:
Small organic molecule
Emp. Form.:
C27H24N6O4
Mol. Mass.:
496.5173
SMILES:
O=CN1Cc2cccc3c(cn(CC1N1CCOCC1)c23)C1=C(C(=O)NC1=O)c1cnc2ccccn12
: