Target
Myosin-2 heavy chain
Ligand
BDBM50449473
Substrate
Meas. Tech.
ChEMBL_1739770 (CHEMBL4155520)
IC50
1900±n/a nM
Citation
 Roman, BIVerhasselt, SStevens, CV Medicinal Chemistry and Use of Myosin II Inhibitor ( S)-Blebbistatin and Its Derivatives. J Med Chem 61:9410-9428 (2018)  
Target
Name:
Myosin-2 heavy chain
Synonyms:
MYS2_DICDI Myosin-2 heavy chain | mhcA
Type:
PROTEIN
Mol. Mass.:
243746.33
Organism:
Dictyostelium discoideum
Description:
ChEMBL_117948
Residue:
2116
  
Inhibitor
Name:
BDBM50449473
Synonyms:
CHEMBL4165503
Type:
Small organic molecule
Emp. Form.:
C18H15ClN2O2
Mol. Mass.:
326.777
SMILES:
Cc1ccc2N=C3N(CC[C@@]3(O)C(=O)c2c1)c1ccc(Cl)cc1
: