Target
Bone morphogenetic protein 1
Ligand
BDBM50458766
Substrate
Meas. Tech.
ChEMBL_1764655 (CHEMBL4199902)
Ki
0.0068±n/a nM
Citation
 Kallander, LSWashburn, DHilfiker, MAEidam, HSLawhorn, BGPrendergast, JFox, RDowdell, SManns, SHoang, TZhao, SYe, GHammond, MHolt, DARoethke, THong, XReid, RAGampe, RZhang, HDiaz, ERendina, ARQuinn, AMWillette, B Reverse Hydroxamate Inhibitors of Bone Morphogenetic Protein 1. ACS Med Chem Lett 9:736-740 (2018)  
Target
Name:
Bone morphogenetic protein 1
Synonyms:
BMP-1 BMP1_HUMAN PCOLC Procollagen C-proteinase | mTld
Type:
PROTEIN
Mol. Mass.:
111254.03
Organism:
Homo sapiens (Human)
Description:
ChEMBL_518962
Residue:
986
  
Inhibitor
Name:
BDBM50458766
Synonyms:
CHEMBL4212386
Type:
Small organic molecule
Emp. Form.:
C30H40N4O11
Mol. Mass.:
632.6588
SMILES:
CCCCC[C@H]([C@@H](CC)N(O)C=O)C(=O)NCNC(=O)c1ccc(o1)-c1ccc(C(=O)N[C@@H](CC(O)=O)C(O)=O)c(OCC)c1
: