Target
Kappa-type opioid receptor
Ligand
BDBM50463294
Substrate
Meas. Tech.
ChEMBL_1777972 (CHEMBL4234964)
Ki
0.400000±n/a nM
Citation
 Sun, HJWang, YHYuan, CMKong, LHXu, XJWang, YJWu, HHLin, CQian, YYHuang, HMXiao, LLiu, XHe, QFang, SYXue, DQYang, XCChen, HZheng, YLZheng, LYu, LQXie, QFu, WLi, WLiu, JGQiu, ZBShao, LM 7?-Methyl substituent is a structural locus associated with activity cliff for nepenthone analogues. Bioorg Med Chem 26:4254-4263 (2018)  
Target
Name:
Kappa-type opioid receptor
Synonyms:
K-OR-1 Kappa-opioid receptor (KOR) Kappa-type opioid receptor (KOR) OPIATE Kappa OPRK1 kappa opioid receptor (KOR)
Type:
G Protein-Coupled Receptor (GPCR)
Mol. Mass.:
42648.76
Organism:
Homo sapiens (Human)
Description:
P41145
Residue:
380
  
Inhibitor
Name:
BDBM50463294
Synonyms:
CHEMBL4249256
Type:
Small organic molecule
Emp. Form.:
C31H33NO4
Mol. Mass.:
483.598
SMILES:
[H][C@@]12Oc3c4c(C[C@@]5([H])N(CC6CC6)CC[C@@]14[C@]51C[C@H](C(=O)c4ccccc4)[C@]2(OC)C=C1)ccc3OC
: