Target
Heat shock protein HSP 90-alpha
Ligand
BDBM50464556
Substrate
Meas. Tech.
ChEMBL_1781426 (CHEMBL4252943)
Kd
3.1±n/a nM
Citation
 Park, SYOh, YJLho, YJeong, JHLiu, KHSong, JKim, SHHa, ESeo, YH Design, synthesis, and biological evaluation of a series of resorcinol-based N-benzyl benzamide derivatives as potent Hsp90 inhibitors. Eur J Med Chem 143:390-401 (2018)  
Target
Name:
Heat shock protein HSP 90-alpha
Synonyms:
HS90A_HUMAN HSP86 HSP90AA1 HSPCA Heat shock 86 kDa Heat shock protein HSP 90-alpha (HSP90) LAP-2 Lipopolysaccharide-associated protein 2 heat shock protein 90kDa alpha (cytosolic), class A member 1 isoform 2
Type:
Molecular Chaperone
Mol. Mass.:
84623.45
Organism:
Homo sapiens (Human)
Description:
P07900
Residue:
732
  
Inhibitor
Name:
BDBM50464556
Synonyms:
CHEMBL4289811 US10889552, Compound 21f
Type:
Small organic molecule
Emp. Form.:
C22H28N2O4
Mol. Mass.:
384.4687
SMILES:
CCCNC(=O)c1ccc(CN(C)C(=O)c2cc(C(C)C)c(O)cc2O)cc1
: