Target
Sialidase-1
Ligand
BDBM50270454
Substrate
Meas. Tech.
ChEMBL_1789505 (CHEMBL4261239)
Ki
830±n/a nM
Citation
 Guo, THéon-Roberts, RZou, CZheng, RPshezhetsky, AVCairo, CW Selective Inhibitors of Human Neuraminidase 1 (NEU1). J Med Chem 61:11261-11279 (2018)  
Target
Name:
Sialidase-1
Synonyms:
NANH NEUR1_HUMAN | Sialidase 1
Type:
PROTEIN
Mol. Mass.:
45463.28
Organism:
Homo sapiens (Human)
Description:
ChEMBL_960639
Residue:
415
  
Inhibitor
Name:
BDBM50270454
Synonyms:
CHEMBL4076483
Type:
Small organic molecule
Emp. Form.:
C16H26N2O8
Mol. Mass.:
374.3862
SMILES:
[H][C@]1(OC(=C[C@H](O)[C@H]1NC(C)=O)C(O)=O)[C@H](O)[C@H](O)CNC(=O)CCCC
: