Target
Sialidase-1
Ligand
BDBM50465968
Substrate
Meas. Tech.
ChEMBL_1789504 (CHEMBL4261238)
Ki
180±n/a nM
Citation
 Guo, THéon-Roberts, RZou, CZheng, RPshezhetsky, AVCairo, CW Selective Inhibitors of Human Neuraminidase 1 (NEU1). J Med Chem 61:11261-11279 (2018)  
Target
Name:
Sialidase-1
Synonyms:
NANH NEUR1_HUMAN | Sialidase 1
Type:
PROTEIN
Mol. Mass.:
45463.28
Organism:
Homo sapiens (Human)
Description:
ChEMBL_960639
Residue:
415
  
Inhibitor
Name:
BDBM50465968
Synonyms:
CHEMBL4291908
Type:
Small organic molecule
Emp. Form.:
C15H25NO8
Mol. Mass.:
347.3609
SMILES:
[H][C@]1(OC(=C[C@H](O)[C@H]1NC(=O)CCCCC)C(O)=O)[C@H](O)[C@H](O)CO
: