Target
Dihydroorotate dehydrogenase (fumarate)
Ligand
BDBM50056908
Substrate
Meas. Tech.
ChEMBL_1791599 (CHEMBL4263518)
IC50
73200±n/a nM
Citation
 Chibli, LASchmidt, TJNonato, MCCalil, FADa Costa, FB Natural products as inhibitors of Leishmania major dihydroorotate dehydrogenase. Eur J Med Chem 157:852-866 (2018)  
Target
Name:
Dihydroorotate dehydrogenase (fumarate)
Synonyms:
1.3.98.1 Dihydroorotate dehydrogenase (fumarate) | Dihydroorotate oxidase
Type:
PROTEIN
Mol. Mass.:
34659.43
Organism:
Leishmania major
Description:
ChEMBL_118088
Residue:
320
  
Inhibitor
Name:
BDBM50056908
Synonyms:
(1R,3R,4S,5R)-3,4-Bis-[(E)-3-(3,4-dihydroxy-phenyl)-acryloyloxy]-1,5-dihydroxy-cyclohexanecarboxylic acid 3,4-di-O-caffeoylquinicacid CHEMBL177126 | NSC-649410
Type:
Small organic molecule
Emp. Form.:
C25H24O12
Mol. Mass.:
516.4509
SMILES:
O[C@@H]1C[C@@](O)(C[C@@H](OC(=O)\C=C\c2ccc(O)c(O)c2)[C@H]1OC(=O)\C=C\c1ccc(O)c(O)c1)C(O)=O
: