Target
Dihydroorotate dehydrogenase (fumarate)
Ligand
BDBM50466093
Substrate
Meas. Tech.
ChEMBL_1791599 (CHEMBL4263518)
IC50
398107±n/a nM
Citation
 Chibli, LASchmidt, TJNonato, MCCalil, FADa Costa, FB Natural products as inhibitors of Leishmania major dihydroorotate dehydrogenase. Eur J Med Chem 157:852-866 (2018)  
Target
Name:
Dihydroorotate dehydrogenase (fumarate)
Synonyms:
1.3.98.1 Dihydroorotate dehydrogenase (fumarate) | Dihydroorotate oxidase
Type:
PROTEIN
Mol. Mass.:
34659.43
Organism:
Leishmania major
Description:
ChEMBL_118088
Residue:
320
  
Inhibitor
Name:
BDBM50466093
Synonyms:
CHEMBL4278464
Type:
Small organic molecule
Emp. Form.:
C29H50O
Mol. Mass.:
414.7067
SMILES:
[H][C@@]1(CC[C@@]2([H])[C@]3([H])CC=C4C[C@@H](O)CC[C@]4(C)[C@@]3([H])CC[C@]12C)[C@@H](C)CC[C@@H](CC)C(C)C
: