Target
Dihydroorotate dehydrogenase (fumarate)
Ligand
BDBM50466100
Substrate
Meas. Tech.
ChEMBL_1791599 (CHEMBL4263518)
IC50
398107±n/a nM
Citation
 Chibli, LASchmidt, TJNonato, MCCalil, FADa Costa, FB Natural products as inhibitors of Leishmania major dihydroorotate dehydrogenase. Eur J Med Chem 157:852-866 (2018)  
Target
Name:
Dihydroorotate dehydrogenase (fumarate)
Synonyms:
1.3.98.1 Dihydroorotate dehydrogenase (fumarate) | Dihydroorotate oxidase
Type:
PROTEIN
Mol. Mass.:
34659.43
Organism:
Leishmania major
Description:
ChEMBL_118088
Residue:
320
  
Inhibitor
Name:
BDBM50466100
Synonyms:
CHEMBL4281688
Type:
Small organic molecule
Emp. Form.:
C14H16O8
Mol. Mass.:
312.272
SMILES:
C[C@](OC(=O)\C=C\c1ccc(O)c(O)c1)([C@@H](O)CO)C(O)=O
: