Target
Dihydroorotate dehydrogenase (fumarate)
Ligand
BDBM50433422
Substrate
Meas. Tech.
ChEMBL_1791599 (CHEMBL4263518)
IC50
251189±n/a nM
Citation
 Chibli, LASchmidt, TJNonato, MCCalil, FADa Costa, FB Natural products as inhibitors of Leishmania major dihydroorotate dehydrogenase. Eur J Med Chem 157:852-866 (2018)  
Target
Name:
Dihydroorotate dehydrogenase (fumarate)
Synonyms:
1.3.98.1 Dihydroorotate dehydrogenase (fumarate) | Dihydroorotate oxidase
Type:
PROTEIN
Mol. Mass.:
34659.43
Organism:
Leishmania major
Description:
ChEMBL_118088
Residue:
320
  
Inhibitor
Name:
BDBM50433422
Synonyms:
BUDLEIN A
Type:
Small organic molecule
Emp. Form.:
C20H22O7
Mol. Mass.:
374.3845
SMILES:
C\C=C(/C)C(=O)O[C@@H]1C[C@@]2(C)OC(=CC2=O)\C(CO)=C/[C@H]2OC(=O)C(=C)[C@H]12
: