Target
Dihydroorotate dehydrogenase (fumarate)
Ligand
BDBM50466095
Substrate
Meas. Tech.
ChEMBL_1791599 (CHEMBL4263518)
IC50
158489±n/a nM
Citation
 Chibli, LASchmidt, TJNonato, MCCalil, FADa Costa, FB Natural products as inhibitors of Leishmania major dihydroorotate dehydrogenase. Eur J Med Chem 157:852-866 (2018)  
Target
Name:
Dihydroorotate dehydrogenase (fumarate)
Synonyms:
1.3.98.1 Dihydroorotate dehydrogenase (fumarate) | Dihydroorotate oxidase
Type:
PROTEIN
Mol. Mass.:
34659.43
Organism:
Leishmania major
Description:
ChEMBL_118088
Residue:
320
  
Inhibitor
Name:
BDBM50466095
Synonyms:
CHEMBL4286822
Type:
Small organic molecule
Emp. Form.:
C19H22O6
Mol. Mass.:
346.3744
SMILES:
[H][C@@]12C[C@H](C)C3=CC(=O)[C@@](C)(C[C@H](OC(=O)C(C)=C)[C@@]1([H])C(=C)C(=O)O2)O3
: