Target
Dihydroorotate dehydrogenase (fumarate)
Ligand
BDBM50466103
Substrate
Meas. Tech.
ChEMBL_1791599 (CHEMBL4263518)
IC50
31623±n/a nM
Citation
 Chibli, LASchmidt, TJNonato, MCCalil, FADa Costa, FB Natural products as inhibitors of Leishmania major dihydroorotate dehydrogenase. Eur J Med Chem 157:852-866 (2018)  
Target
Name:
Dihydroorotate dehydrogenase (fumarate)
Synonyms:
1.3.98.1 Dihydroorotate dehydrogenase (fumarate) | Dihydroorotate oxidase
Type:
PROTEIN
Mol. Mass.:
34659.43
Organism:
Leishmania major
Description:
ChEMBL_118088
Residue:
320
  
Inhibitor
Name:
BDBM50466103
Synonyms:
CHEBI:15417 Kaurenoic Acid
Type:
Small organic molecule
Emp. Form.:
C20H30O2
Mol. Mass.:
302.451
SMILES:
[H][C@@]12C[C@]3(CC1=C)CC[C@]1([H])[C@@](C)(CCC[C@@]1(C)[C@]3([H])CC2)C(O)=O
: