Target
Dihydroorotate dehydrogenase (fumarate)
Ligand
BDBM50325674
Substrate
Meas. Tech.
ChEMBL_1791599 (CHEMBL4263518)
IC50
93700±n/a nM
Citation
 Chibli, LASchmidt, TJNonato, MCCalil, FADa Costa, FB Natural products as inhibitors of Leishmania major dihydroorotate dehydrogenase. Eur J Med Chem 157:852-866 (2018)  
Target
Name:
Dihydroorotate dehydrogenase (fumarate)
Synonyms:
1.3.98.1 Dihydroorotate dehydrogenase (fumarate) | Dihydroorotate oxidase
Type:
PROTEIN
Mol. Mass.:
34659.43
Organism:
Leishmania major
Description:
ChEMBL_118088
Residue:
320
  
Inhibitor
Name:
BDBM50325674
Synonyms:
3,5,7-trihydroxy-2-(3-hydroxy-4-methoxyphenyl)-4H-chromen-4-one Tamarixetin (22) | tamarixetin
Type:
Small organic molecule
Emp. Form.:
C16H12O7
Mol. Mass.:
316.2623
SMILES:
COc1ccc(cc1O)-c1oc2cc(O)cc(O)c2c(=O)c1O
: