Target
Dihydroorotate dehydrogenase (fumarate)
Ligand
BDBM84981
Substrate
Meas. Tech.
ChEMBL_1791599 (CHEMBL4263518)
IC50
217000±n/a nM
Citation
 Chibli, LASchmidt, TJNonato, MCCalil, FADa Costa, FB Natural products as inhibitors of Leishmania major dihydroorotate dehydrogenase. Eur J Med Chem 157:852-866 (2018)  
Target
Name:
Dihydroorotate dehydrogenase (fumarate)
Synonyms:
1.3.98.1 Dihydroorotate dehydrogenase (fumarate) | Dihydroorotate oxidase
Type:
PROTEIN
Mol. Mass.:
34659.43
Organism:
Leishmania major
Description:
ChEMBL_118088
Residue:
320
  
Inhibitor
Name:
BDBM84981
Synonyms:
Luteolin-7,3',4'-trimethylether
Type:
Small organic molecule
Emp. Form.:
C18H16O6
Mol. Mass.:
328.316
SMILES:
COc1cc(O)c2c(c1)oc(cc2=O)-c1ccc(OC)c(OC)c1
: