Target
Dihydroorotate dehydrogenase (fumarate)
Ligand
BDBM50466092
Substrate
Meas. Tech.
ChEMBL_1791599 (CHEMBL4263518)
IC50
199000±n/a nM
Citation
 Chibli, LASchmidt, TJNonato, MCCalil, FADa Costa, FB Natural products as inhibitors of Leishmania major dihydroorotate dehydrogenase. Eur J Med Chem 157:852-866 (2018)  
Target
Name:
Dihydroorotate dehydrogenase (fumarate)
Synonyms:
1.3.98.1 Dihydroorotate dehydrogenase (fumarate) | Dihydroorotate oxidase
Type:
PROTEIN
Mol. Mass.:
34659.43
Organism:
Leishmania major
Description:
ChEMBL_118088
Residue:
320
  
Inhibitor
Name:
BDBM50466092
Synonyms:
CHEMBL4287504
Type:
Small organic molecule
Emp. Form.:
C27H30O15
Mol. Mass.:
594.5181
SMILES:
O[C@H]1CC[C@@H](OC[C@H]2O[C@@H](Oc3c(oc4cc(O)cc(O)c4c3=O)-c3ccc(O)c(O)c3)[C@H](O)[C@@H](O)[C@@H]2O)[C@H](O)[C@H]1O
: