Target
Dihydroorotate dehydrogenase (fumarate)
Ligand
BDBM50466115
Substrate
Meas. Tech.
ChEMBL_1791599 (CHEMBL4263518)
IC50
103400±n/a nM
Citation
 Chibli, LASchmidt, TJNonato, MCCalil, FADa Costa, FB Natural products as inhibitors of Leishmania major dihydroorotate dehydrogenase. Eur J Med Chem 157:852-866 (2018)  
Target
Name:
Dihydroorotate dehydrogenase (fumarate)
Synonyms:
1.3.98.1 Dihydroorotate dehydrogenase (fumarate) | Dihydroorotate oxidase
Type:
PROTEIN
Mol. Mass.:
34659.43
Organism:
Leishmania major
Description:
ChEMBL_118088
Residue:
320
  
Inhibitor
Name:
BDBM50466115
Synonyms:
1Beta,2Alpha-Epoxytagitinin C | CHEMBL516873
Type:
Small organic molecule
Emp. Form.:
C19H24O7
Mol. Mass.:
364.3897
SMILES:
[H][C@@]12O[C@@]1([H])[C@](C)(O)C[C@@H](OC(=O)C(C)C)[C@@]1([H])C(=C)C(=O)O[C@]1([H])\C=C(C)/C2=O
: