Target
Dihydroorotate dehydrogenase (fumarate)
Ligand
BDBM50088447
Substrate
Meas. Tech.
ChEMBL_1791599 (CHEMBL4263518)
IC50
171900±n/a nM
Citation
 Chibli, LASchmidt, TJNonato, MCCalil, FADa Costa, FB Natural products as inhibitors of Leishmania major dihydroorotate dehydrogenase. Eur J Med Chem 157:852-866 (2018)  
Target
Name:
Dihydroorotate dehydrogenase (fumarate)
Synonyms:
1.3.98.1 Dihydroorotate dehydrogenase (fumarate) | Dihydroorotate oxidase
Type:
PROTEIN
Mol. Mass.:
34659.43
Organism:
Leishmania major
Description:
ChEMBL_118088
Residue:
320
  
Inhibitor
Name:
BDBM50088447
Synonyms:
(+)-Artemisinin | CHEBI:223316
Type:
Small organic molecule
Emp. Form.:
C15H22O5
Mol. Mass.:
282.3322
SMILES:
[H][C@@]12CC[C@@H](C)[C@]3([H])CC[C@@]4(C)OO[C@@]13[C@]([H])(OC(=O)[C@@H]2C)O4
: