Target
Dihydroorotate dehydrogenase (fumarate)
Ligand
BDBM50466116
Substrate
Meas. Tech.
ChEMBL_1791599 (CHEMBL4263518)
IC50
277000±n/a nM
Citation
 Chibli, LASchmidt, TJNonato, MCCalil, FADa Costa, FB Natural products as inhibitors of Leishmania major dihydroorotate dehydrogenase. Eur J Med Chem 157:852-866 (2018)  
Target
Name:
Dihydroorotate dehydrogenase (fumarate)
Synonyms:
1.3.98.1 Dihydroorotate dehydrogenase (fumarate) | Dihydroorotate oxidase
Type:
PROTEIN
Mol. Mass.:
34659.43
Organism:
Leishmania major
Description:
ChEMBL_118088
Residue:
320
  
Inhibitor
Name:
BDBM50466116
Synonyms:
CHEMBL4159192
Type:
Small organic molecule
Emp. Form.:
C19H20O6
Mol. Mass.:
344.3585
SMILES:
[H][C@]12OC(=O)C(=C)[C@]1([H])[C@H](C[C@@]1(C)OC(=CC1=O)\C(C)=C/2)OC(=O)C(C)=C
: