Target
Dihydroorotate dehydrogenase (fumarate)
Ligand
BDBM16430
Substrate
Meas. Tech.
ChEMBL_1791599 (CHEMBL4263518)
IC50
398107±n/a nM
Citation
 Chibli, LASchmidt, TJNonato, MCCalil, FADa Costa, FB Natural products as inhibitors of Leishmania major dihydroorotate dehydrogenase. Eur J Med Chem 157:852-866 (2018)  
Target
Name:
Dihydroorotate dehydrogenase (fumarate)
Synonyms:
1.3.98.1 Dihydroorotate dehydrogenase (fumarate) | Dihydroorotate oxidase
Type:
PROTEIN
Mol. Mass.:
34659.43
Organism:
Leishmania major
Description:
ChEMBL_118088
Residue:
320
  
Inhibitor
Name:
BDBM16430
Synonyms:
(2E)-3-phenylprop-2-enoic acid Cinnamic acid Zimtsaeure t-Cinnamic acid | trans-Cinnamate
Type:
Small organic molecule
Emp. Form.:
C9H8O2
Mol. Mass.:
148.1586
SMILES:
OC(=O)\C=C\c1ccccc1
: