Target
Protein mono-ADP-ribosyltransferase PARP4
Ligand
BDBM199181
Substrate
Meas. Tech.
ChEMBL_1800453 (CHEMBL4272745)
IC50
23000±n/a nM
Citation
 Murthy, SDesantis, JVerheugd, PMaksimainen, MMVenkannagari, HMassari, SAshok, YObaji, ENkizinkinko, YLüscher, BTabarrini, OLehtiö, L 4-(Phenoxy) and 4-(benzyloxy)benzamides as potent and selective inhibitors of mono-ADP-ribosyltransferase PARP10/ARTD10. Eur J Med Chem 156:93-102 (2018)  
Target
Name:
Protein mono-ADP-ribosyltransferase PARP4
Synonyms:
(ARTD4 or PARP4) 2.4.2.- ADP-ribosyltransferase diphtheria toxin-like 4 ADPRTL1 KIAA0177 PARP-4 PARP4 PARPL Poly [ADP-ribose] polymerase 4 VPARP | Vault poly(ADP-ribose) polymerase
Type:
Mol. Mass.:
192563.23
Organism:
Homo sapiens (Human)
Description:
Q9UKK3
Residue:
1724
  
Inhibitor
Name:
BDBM199181
Synonyms:
4-[(4-Carbamoylcyclohexyl)oxy]cyclohexane-1-carboxamide (OUL35)
Type:
Small organic molecule
Emp. Form.:
C14H12N2O3
Mol. Mass.:
256.2567
SMILES:
NC(=O)c1ccc(Oc2ccc(cc2)C(N)=O)cc1
: