Target
5-hydroxytryptamine receptor 3A
Ligand
BDBM85099
Substrate
Meas. Tech.
ChEMBL_3114 (CHEMBL617957)
Kd
19953±n/a nM
Citation
 Nozulak, JKalkman, HOFloersheim, PHoyer, DSchoeffter, PBuerki, HR (+)-cis-4,5,7a,8,9,10,11,11a-octahydro-7H-10-methylindolo[1,7- bc][2,6]-naphthyridine: a 5-HT2C/2B receptor antagonist with low 5-HT2A receptor affinity. J Med Chem 38:28-33 (1995)  
Target
Name:
5-hydroxytryptamine receptor 3A
Synonyms:
5-HT-3 5-HT3A 5-HT3R 5-hydroxytryptamine receptor 3A 5ht3 Htr3a Serotonin 3a (5-HT3a) receptor Serotonin-gated ion channel receptor
Type:
Mol. Mass.:
56056.00
Organism:
Mus musculus (house mouse)
Description:
5HT3A
Residue:
487
  
Inhibitor
Name:
BDBM85099
Synonyms:
CAS_141474-54-6 SDZ SER-082 | SER-082
Type:
Small organic molecule
Emp. Form.:
C15H20N2
Mol. Mass.:
228.3327
SMILES:
CN1CC[C@@H]2CN3CCc4cccc([C@@H]2C1)c34
: