Target
Melatonin receptor type 1A
Ligand
BDBM50475065
Substrate
Meas. Tech.
ChEMBL_304031 (CHEMBL840209)
Ki
3.0±n/a nM
Citation
 Lucini, VPannacci, MScaglione, FFraschini, FRivara, SMor, MBordi, FPlazzi, PVSpadoni, GBedini, APiersanti, GDiamantini, GTarzia, G Tricyclic alkylamides as melatonin receptor ligands with antagonist or inverse agonist activity. J Med Chem 47:4202-12 (2004)  
Target
Name:
Melatonin receptor type 1A
Synonyms:
MTNR1A MTR1A_HUMAN Mel1a melatonin receptor Melatonin receptor Melatonin receptor type 1 (MT1) | Melatonin receptor type 1A
Type:
Enzyme
Mol. Mass.:
39392.94
Organism:
Homo sapiens (Human)
Description:
P48039
Residue:
350
  
Inhibitor
Name:
BDBM50475065
Synonyms:
CHEMBL427516
Type:
Small organic molecule
Emp. Form.:
C19H19NO3
Mol. Mass.:
309.3591
SMILES:
COc1ccc2c(c1)C(CNC(C)=O)Cc1ccccc1C2=O
: