Target
Melatonin receptor type 1B
Ligand
BDBM50011349
Substrate
Meas. Tech.
ChEMBL_304028 (CHEMBL840206)
Ki
0.660693±n/a nM
Citation
 Lucini, VPannacci, MScaglione, FFraschini, FRivara, SMor, MBordi, FPlazzi, PVSpadoni, GBedini, APiersanti, GDiamantini, GTarzia, G Tricyclic alkylamides as melatonin receptor ligands with antagonist or inverse agonist activity. J Med Chem 47:4202-12 (2004)  
Target
Name:
Melatonin receptor type 1B
Synonyms:
MTNR1B Mel-1B-R Melatonin 1B Melatonin receptor type 1B | Melatonin receptor type 2 (MT2)
Type:
Enzyme
Mol. Mass.:
40203.54
Organism:
Homo sapiens (Human)
Description:
P49286
Residue:
362
  
Inhibitor
Name:
BDBM50011349
Synonyms:
CHEMBL189449
Type:
Small organic molecule
Emp. Form.:
C19H21NO2
Mol. Mass.:
295.3755
SMILES:
COc1ccc2Cc3ccccc3CC(CNC(C)=O)c2c1
: