Target
Retinoic acid receptor beta
Ligand
BDBM50413267
Substrate
Meas. Tech.
ChEMBL_326476 (CHEMBL864468)
EC50
25±n/a nM
Citation
 Lund, BWPiu, FGauthier, NKEeg, ACurrier, ESherbukhin, VBrann, MRHacksell, UOlsson, R Discovery of a potent, orally available, and isoform-selective retinoic acid beta2 receptor agonist. J Med Chem 48:7517-9 (2005)  
Target
Name:
Retinoic acid receptor beta
Synonyms:
HAP NR1B2 RAR-beta RARB Retinoic acid receptor RXR-alpha/Retinoic acid receptor beta Retinoid receptor
Type:
PROTEIN
Mol. Mass.:
50498.70
Organism:
Homo sapiens (Human)
Description:
ChEMBL_1458015
Residue:
455
  
Inhibitor
Name:
BDBM50413267
Synonyms:
CHEMBL371684
Type:
Small organic molecule
Emp. Form.:
C20H24O2
Mol. Mass.:
296.4034
SMILES:
CCCCCCCc1ccc(cc1)-c1ccc(cc1)C(O)=O
: