Target
Phenylalanine-4-hydroxylase
Ligand
BDBM50028424
Substrate
Meas. Tech.
ChEBML_154856
Ki
85000±n/a nM
Citation
 Henrie, RNLazarus, RABenkovic, SJ Preparation of 2-amino-4(3H)-oxopyrimido[5,4-b] [1,4]thiazines (5-thiapterins) and their evaluation as cofactors for phenylalanine hydroxylase. J Med Chem 26:559-63 (1983)  
Target
Name:
Phenylalanine-4-hydroxylase
Synonyms:
PH4H_RAT Phe-4-monooxygenase
Type:
PROTEIN
Mol. Mass.:
51817.61
Organism:
Rattus norvegicus
Description:
ChEMBL_154856
Residue:
453
  
Inhibitor
Name:
BDBM50028424
Synonyms:
2-Amino-7,8-dihydro-3H,6H-pyrimido[5,4-b][1,4]thiazin-4-one | CHEMBL152878
Type:
Small organic molecule
Emp. Form.:
C6H8N4OS
Mol. Mass.:
184.219
SMILES:
Nc1nc2NCCSc2c(=O)[nH]1
: