Target
Phenylalanine-4-hydroxylase
Ligand
BDBM50028428
Substrate
Meas. Tech.
ChEBML_154856
Ki
4700±n/a nM
Citation
 Henrie, RNLazarus, RABenkovic, SJ Preparation of 2-amino-4(3H)-oxopyrimido[5,4-b] [1,4]thiazines (5-thiapterins) and their evaluation as cofactors for phenylalanine hydroxylase. J Med Chem 26:559-63 (1983)  
Target
Name:
Phenylalanine-4-hydroxylase
Synonyms:
PH4H_RAT Phe-4-monooxygenase
Type:
PROTEIN
Mol. Mass.:
51817.61
Organism:
Rattus norvegicus
Description:
ChEMBL_154856
Residue:
453
  
Inhibitor
Name:
BDBM50028428
Synonyms:
2,6-Diamino-5-phenylsulfanyl-3H-pyrimidin-4-one | CHEMBL149587
Type:
Small organic molecule
Emp. Form.:
C10H10N4OS
Mol. Mass.:
234.278
SMILES:
Nc1nc(N)c(Sc2ccccc2)c(=O)[nH]1
: