Target
Reverse transcriptase
Ligand
BDBM50424077
Substrate
Meas. Tech.
ChEMBL_545151 (CHEMBL1018093)
IC50
>562000±n/a nM
Citation
 Tan, GTPezzuto, JMKinghorn, ADHughes, SH Evaluation of natural products as inhibitors of human immunodeficiency virus type 1 (HIV-1) reverse transcriptase. J Nat Prod 54:143-54 
Target
Name:
Reverse transcriptase
Synonyms:
Type:
Protein
Mol. Mass.:
29598.37
Organism:
Human immunodeficiency virus 1
Description:
Q9WKE8
Residue:
254
  
Inhibitor
Name:
BDBM50424077
Synonyms:
(-)-Tetrahydropalmatine TETRAHYDROPALMATINE
Type:
Small organic molecule
Emp. Form.:
C21H25NO4
Mol. Mass.:
355.4275
SMILES:
COc1cc2CCN3Cc4c(C[C@H]3c2cc1OC)ccc(OC)c4OC
: