Target
Reverse transcriptase
Ligand
BDBM50226664
Substrate
Meas. Tech.
ChEMBL_545151 (CHEMBL1018093)
IC50
171000±n/a nM
Citation
 Tan, GTPezzuto, JMKinghorn, ADHughes, SH Evaluation of natural products as inhibitors of human immunodeficiency virus type 1 (HIV-1) reverse transcriptase. J Nat Prod 54:143-54 
Target
Name:
Reverse transcriptase
Synonyms:
Type:
Protein
Mol. Mass.:
29598.37
Organism:
Human immunodeficiency virus 1
Description:
Q9WKE8
Residue:
254
  
Inhibitor
Name:
BDBM50226664
Synonyms:
2-hydroxy-3,9,10-trimethoxy-5,6-dihydroisoquino[3,2-a]isoquinolinium columbamine
Type:
Small organic molecule
Emp. Form.:
C20H20NO4
Mol. Mass.:
338.3766
SMILES:
COc1cc2CC[n+]3cc4c(OC)c(OC)ccc4cc3-c2cc1O
: