Target
UDP-3-O-acyl-N-acetylglucosamine deacetylase
Ligand
BDBM50200120
Substrate
Meas. Tech.
ChEMBL_809999 (CHEMBL2015108)
Ki
2.0±n/a nM
Citation
 Warmus, JSQuinn, CLTaylor, CMurphy, STJohnson, TALimberakis, COrtwine, DBronstein, JPagano, PKnafels, JDLightle, SMochalkin, IBrideau, RPodoll, T Structure based design of an in vivo active hydroxamic acid inhibitor of P. aeruginosa LpxC. Bioorg Med Chem Lett 22:2536-43 (2012)  
Target
Name:
UDP-3-O-acyl-N-acetylglucosamine deacetylase
Synonyms:
LPXC_ECOLI UDP-3-O-[3-hydroxymyristoyl] N-acetylglucosamine deacetylase (LxpC) asmB lpxC
Type:
Enzyme
Mol. Mass.:
33952.00
Organism:
Escherichia coli
Description:
P0A725
Residue:
305
  
Inhibitor
Name:
BDBM50200120
Synonyms:
CHEMBL260091 US10875832, Compound ChIR-090
Type:
Small organic molecule
Emp. Form.:
C24H27N3O5
Mol. Mass.:
437.4883
SMILES:
C[C@@H](O)[C@H](NC(=O)c1ccc(cc1)C#Cc1ccc(CN2CCOCC2)cc1)C(=O)NO
: