Target
Cellular retinoic acid-binding protein 2
Ligand
BDBM50031457
Substrate
Meas. Tech.
ChEMBL_52402 (CHEMBL665905)
Kd
>200±n/a nM
Citation
 Alam, MZhestkov, VSani, BPVenepally, PLevin, AAKazmer, SLi, ENorris, AWZhang, XKLee, MO Conformationally defined 6-s-trans-retinoic acid analogs. 2. Selective agonists for nuclear receptor binding and transcriptional activity. J Med Chem 38:2302-10 (1995)  
Target
Name:
Cellular retinoic acid-binding protein 2
Synonyms:
Cellular retinoic acid-binding protein II RABP2_MOUSE
Type:
PROTEIN
Mol. Mass.:
15744.92
Organism:
Mus musculus
Description:
ChEMBL_52402
Residue:
138
  
Inhibitor
Name:
BDBM50031457
Synonyms:
(2Z,5E)-3-{(E)-3-[3-Ethyl-2-isopropyl-cyclohex-2-en-(E)-ylidene]-2-methyl-propenyl}-5-methyl-hepta-2,5-dienoic acid | CHEMBL72988
Type:
Small organic molecule
Emp. Form.:
C23H34O2
Mol. Mass.:
342.5149
SMILES:
CCC1=C(C(C)C)\C(CCC1)=C\C(\C)=C\C(\C\C(C)=C\C)=C/C(O)=O
: