Target
Leukotriene B4 receptor 1
Ligand
BDBM50033753
Substrate
Meas. Tech.
ChEMBL_99509 (CHEMBL708407)
IC50
15.5±n/a nM
Citation
 Penning, TDDjuric, SWMiyashiro, JMYu, SSnyder, JPSpangler, DAnglin, CPFretland, DJKachur, JFKeith, RH Second-generation leukotriene B4 receptor antagonists related to SC-41930: heterocyclic replacement of the methyl ketone pharmacophore. J Med Chem 38:858-68 (1995)  
Target
Name:
Leukotriene B4 receptor 1
Synonyms:
BLT BLTR Chemoattractant receptor-like 1 GPR16 LTB4-R 1 Leukotriene B4 R1 Leukotriene B4 receptor 1 P2Y purinoceptor 7 | P2Y7
Type:
Enzyme Catalytic Domain
Mol. Mass.:
37582.68
Organism:
Homo sapiens (Human)
Description:
Q15722
Residue:
352
  
Inhibitor
Name:
BDBM50033753
Synonyms:
4-[3-(2-Cyclopropylmethyl-3-methoxy-4-thiazol-4-yl-phenoxy)-propoxy]-5-propyl-7-oxa-bicyclo[4.2.0]octa-1,3,5-triene-8-carboxylic acid | CHEMBL435665
Type:
Small organic molecule
Emp. Form.:
C28H31NO6S
Mol. Mass.:
509.614
SMILES:
CCCc1c2OC(C(O)=O)c2ccc1OCCCOc1ccc(-c2cscn2)c(OC)c1CC1CC1
: