Target
Leukotriene B4 receptor 1
Ligand
BDBM50033744
Substrate
Meas. Tech.
ChEMBL_99509 (CHEMBL708407)
IC50
5.2±n/a nM
Citation
 Penning, TDDjuric, SWMiyashiro, JMYu, SSnyder, JPSpangler, DAnglin, CPFretland, DJKachur, JFKeith, RH Second-generation leukotriene B4 receptor antagonists related to SC-41930: heterocyclic replacement of the methyl ketone pharmacophore. J Med Chem 38:858-68 (1995)  
Target
Name:
Leukotriene B4 receptor 1
Synonyms:
BLT BLTR Chemoattractant receptor-like 1 GPR16 LTB4-R 1 Leukotriene B4 R1 Leukotriene B4 receptor 1 P2Y purinoceptor 7 | P2Y7
Type:
Enzyme Catalytic Domain
Mol. Mass.:
37582.68
Organism:
Homo sapiens (Human)
Description:
Q15722
Residue:
352
  
Inhibitor
Name:
BDBM50033744
Synonyms:
7-{3-[3-Methoxy-2-propyl-4-(3H-[1,2,3]triazol-4-yl)-phenoxy]-propoxy}-8-propyl-chroman-2-carboxylic acid | CHEMBL354553
Type:
Small organic molecule
Emp. Form.:
C28H35N3O6
Mol. Mass.:
509.594
SMILES:
CCCc1c(OCCCOc2ccc3CCC(Oc3c2CCC)C(O)=O)ccc(-c2c[nH]nn2)c1OC
: