Target
Leukotriene B4 receptor 1
Ligand
BDBM50033752
Substrate
Meas. Tech.
ChEMBL_99507 (CHEMBL708405)
IC50
890±n/a nM
Citation
 Penning, TDDjuric, SWMiyashiro, JMYu, SSnyder, JPSpangler, DAnglin, CPFretland, DJKachur, JFKeith, RH Second-generation leukotriene B4 receptor antagonists related to SC-41930: heterocyclic replacement of the methyl ketone pharmacophore. J Med Chem 38:858-68 (1995)  
Target
Name:
Leukotriene B4 receptor 1
Synonyms:
BLT BLTR Chemoattractant receptor-like 1 GPR16 LTB4-R 1 Leukotriene B4 R1 Leukotriene B4 receptor 1 P2Y purinoceptor 7 | P2Y7
Type:
Enzyme Catalytic Domain
Mol. Mass.:
37582.68
Organism:
Homo sapiens (Human)
Description:
Q15722
Residue:
352
  
Inhibitor
Name:
BDBM50033752
Synonyms:
7-{3-[4-(2-Mercapto-thiazol-4-yl)-3-methoxy-2-propyl-phenoxy]-propoxy}-8-propyl-chroman-2-carboxylic acid | CHEMBL169722
Type:
Small organic molecule
Emp. Form.:
C29H35NO6S2
Mol. Mass.:
557.721
SMILES:
CCCc1c(OCCCOc2ccc3CCC(Oc3c2CCC)C(O)=O)ccc(-c2csc(S)n2)c1OC
: