Target
Gag-Pol polyprotein [489-587]
Ligand
BDBM50037122
Substrate
Meas. Tech.
ChEMBL_157870 (CHEMBL879227)
Ki
83±n/a nM
Citation
 Thompson, SKMurthy, KHZhao, BWinborne, EGreen, DWFisher, SMDesJarlais, RLTomaszek, TAMeek, TDGleason, JG Rational design, synthesis, and crystallographic analysis of a hydroxyethylene-based HIV-1 protease inhibitor containing a heterocyclic P1'--P2' amide bond isostere. J Med Chem 37:3100-7 (1994)  
Target
Name:
Gag-Pol polyprotein [489-587]
Synonyms:
Human immunodeficiency virus type 1 protease Pol polyprotein | gag-pol
Type:
Enzyme Subunit
Mol. Mass.:
10781.16
Organism:
Human immunodeficiency virus type 1
Description:
P04585[489-587]
Residue:
99
  
Inhibitor
Name:
BDBM50037122
Synonyms:
CHEMBL108016 | [(1S,2S,4R)-1-Benzyl-2-hydroxy-4-(5-isobutyryl-1H-imidazol-2-yl)-5-phenyl-pentyl]-carbamic acid tert-butyl ester
Type:
Small organic molecule
Emp. Form.:
C30H39N3O4
Mol. Mass.:
505.6484
SMILES:
CC(C)C(=O)c1cnc([nH]1)[C@@H](C[C@H](O)[C@H](Cc1ccccc1)NC(=O)OC(C)(C)C)Cc1ccccc1
: